{"text_format":"1","workbook":"xlsx","n_sheets":7,"sheets":["Notes","Datasheet","Pupil Data Form","Ethnicity Codes","Country of Birth & Nationality","Language Codes","SEN Codes"],"not_rendered":{"charts":0,"images":1,"macros":1,"external_links":1,"defined_names":12,"comments":1,"pivot_tables":0},"unopened":[],"bounds":{"document_bytes":16777216,"sheet_cells":100000,"rows_first":2000,"rows_last":500,"rows_between":2000,"halvings":0,"cell_chars":16384,"cell_head_chars":4096},"cells_cut":0,"cells_raw":0,"read":"whole","date_system":"1900"}

{"sheet":"Notes","index":0,"n_rows":23,"n_cols":1,"rows_kept":23,"cut":false,"hidden":false,"merged":[]}
["NOTES ON USING THE PUPIL DATASHEET GENERATOR"]
[]
[]
["This Excel file contains data on the pupils transferring to your school next September."]
["The information has been collated from primary schools, admission records and other LA held datasets. "]
[]
["There are two worksheets:"]
[]
["The Datasheet"]
["This includes the names of the pupils expected to be transferring to your school, along with their basic characteristics "]
["and provisional KS2 Teacher Assessments. Primary schools have indicated where additional support agencies"]
["have been involved with a pupil. There is also a confidential information flag at the end of the datasheet alerting "]
["secondary schools to cases where sensitive information needs to be transferred. Secondary schools are asked to make "]
["contact with the primary school to ensure that this information is transferred in an appropriate way."]
[]
["The Pupil Data Form"]
["There is also a Pupil Data Form which is linked to the Datasheet and can be used to print off information "]
["for an individual pupil on a side of A4."]
[]
["Each pupil has a number in the datasheet. By typing this number into the red box in the top right hand corner of the"]
["Pupil Data Form, the form will change to present the information for the required individual pupil. This can then be "]
["printed and used during the primary school visit. You can print all data forms by pressing the 'Print all' button. This"]
["will not work if you cannot enable macros."]

{"sheet":"Datasheet","index":1,"n_rows":316,"n_cols":46,"rows_kept":316,"cut":false,"hidden":false,"merged":[[9,29,9,32],[9,34,9,42],[10,34,10,42],[15,33,15,42],[1,33,1,37],[2,34,2,37],[3,2,4,4],[3,34,3,37],[4,5,6,5],[4,34,4,37],[5,2,6,4],[4,6,6,10]]}
["PRIMARY TO SECONDARY TRANSITION: EARLY TRANSFER FORM",null,null,null,null,null,null,null," "]
["Some of the cells have drop-down menus available to assist with the data entry. Click on the relevant cell and the downward arrow to access the valid options.",null,null,null,null,null,null,null,null,null,null,null,null,null,null,null,null,null,null,null,null,null,null,null,null,null,null,null,null,null,null,null,null,"Other Agency Involvement Key"]
[null,null,null,null,null,null,null,null,null,null,null,null,null,null,null,null,null,null,null,null,null,null,null,null,null,null,null,null,null,null,null,null,null,"EHAP","Early help assessment plan (previously CAF)"]
["KEY",null,"Prepopulated by LA (for pupils on roll during Spring census)",null,null,null,"Please complete as appropriate",null,null,null,null,null,null,null,null,null,null,null,null,null,null,null,null,null,null,null,null,null,null,null,null,null,null,"EPS","Educational Psychologist Service"]
[null,null,null,null,null,null,"You are not expected to complete predicted teacher assessments for end of key stage 2 this year so please leave these columns blank and we will populate them centrally following the national teacher assessment submission date (June 29 2017)",null,null,null,null,null,null,null,null,null,null,null,null,null,null,null,null,null,null,null,null,null,null,null,null,null,null,"ESW","Education Social Workers"]
[null,null,"Please complete where known, LA will also match to admissions data at a later date."]
[]
[]
[]
[null,"School Details",null,null,null,null,"Pupil Characteristics",null,null,null,null,null,null,null,null,null,null,null,null,null,null,null,null,null,null,null,null,null,null,"KS2 Provisional Teacher Assessments",null,null,null,null,"Other Agency Involvement/Additional Support",null,null,null,null,null,null,null,null,"Confidential ","Postcode","Home LA"]
[null,null,null,null,null,null,null,null,null,null,null,null,null,null,null,null,null,null,null,null,null,null,null,null,null,null,null,null,null,null,null,null,null,null,"(supporting documents available from the primary school)",null,null,null,null,null,null,null,null,"Information"]
[null,"Primary ","Primary ","Secondary","Secondary","Admissions","UPN","Surname","Forename","Full Name","DOB","Gender","Date of ","FSM","Pupil premium","Ethnicity","Country","Pupil","SEN","SEN ","First","Proficiency","Attendance","Attendance","Looked","Traveller","On the ","Specific ","Modern"]
[null,"DFE No.","School","DFE No. ","Destination ","Status",null,null,null,null,null,null,"Entry",null," (FSM6)",null,"of Birth","nationality","Status","Primary","Language","in","Full Year ","Autumn ","After",null,"Gifted","Gift/Talent/","Foreign","Reading","Writing","Maths","Science","EHAP","Behaviour","EPS","ESW","SEN","EAL","LAC","Travellers","Sensory","Other","(pl. mark an X "]
[null,null,null,"(if known)","(if known)","(Completed by LA)",null,null,null,null,null,null,null,null," 2015/16",null,null,null,null,"Need",null,"English","NC Yr 5","Term NC ",null,null,"& Talented","Interest","Language",null,null,null,null,null,"Support",null,null,null,null,"Team","Team","Impairment",null,"for the secondary"]
[null,null,null,null,null,null,null,null,null,null,null,"(pl. select",null,"(pl. select","(pl. select","(pl. select","(pl. select","(pl. select","(pl. select","(pl. select","(pl. select","(pl. select",null,"Yr 6","(pl. select","(pl. select","Register","(free text ","(Y6)","(pl. select","(pl. select","(pl. select","(pl. select",null,null,null,null,null,null,null,null,null,null,"sch to contact"]
[null,null,null,null,null,null,null,null,null,null,null,"from menu)",null,"from menu)","from menu)","from menu)","from menu)","from menu)","from menu)","from menu)","from menu)","from menu)",null,null,"from menu)","from menu)","(pl. select)","field)","(pl. select)","from menu)","from menu)","from menu)","from menu)","(pl. mark an X in the relevant field to indicate other agency involvement/additional support received by the pupil)",null,null,null,null,null,null,null,null,null," the primary sch)"]
[1]
[2]
[3,null,null,null,null,null,null,null,null,{"$f":"CONCATENATE(I19,\" \",H19)","v":" "}]
[4,null,null,null,null,null,null,null,null," "]
[5,null,null,null,null,null,null,null,null," "]
[6,null,null,null,null,null,null,null,null," "]
[7,null,null,null,null,null,null,null,null," "]
[8,null,null,null,null,null,null,null,null," "]
[9,null,null,null,null,null,null,null,null," "]
[10,null,null,null,null,null,null,null,null," "]
[11,null,null,null,null,null,null,null,null," "]
[12,null,null,null,null,null,null,null,null," "]
[13,null,null,null,null,null,null,null,null," "]
[14,null,null,null,null,null,null,null,null," "]
[15,null,null,null,null,null,null,null,null," "]
[16,null,null,null,null,null,null,null,null," "]
[17,null,null,null,null,null,null,null,null," "]
[18,null,null,null,null,null,null,null,null," "]
[19,null,null,null,null,null,null,null,null," "]
[20,null,null,null,null,null,null,null,null," "]
[21,null,null,null,null,null,null,null,null," "]
[22,null,null,null,null,null,null,null,null," "]
[23,null,null,null,null,null,null,null,null," "]
[24,null,null,null,null,null,null,null,null," "]
[25,null,null,null,null,null,null,null,null," "]
[26,null,null,null,null,null,null,null,null," "]
[27,null,null,null,null,null,null,null,null," "]
[28,null,null,null,null,null,null,null,null," "]
[29,null,null,null,null,null,null,null,null," "]
[30,null,null,null,null,null,null,null,null," "]
[31,null,null,null,null,null,null,null,null," "]
[32,null,null,null,null,null,null,null,null," "]
[33,null,null,null,null,null,null,null,null," "]
[34,null,null,null,null,null,null,null,null," "]
[35,null,null,null,null,null,null,null,null," "]
[36,null,null,null,null,null,null,null,null," "]
[37,null,null,null,null,null,null,null,null," "]
[38,null,null,null,null,null,null,null,null," "]
[39,null,null,null,null,null,null,null,null," "]
[40,null,null,null,null,null,null,null,null," "]
[41,null,null,null,null,null,null,null,null," "]
[42,null,null,null,null,null,null,null,null," "]
[43,null,null,null,null,null,null,null,null," "]
[44,null,null,null,null,null,null,null,null," "]
{"$rows_left_out":257}
{"sheet":"Pupil Data Form","index":2,"n_rows":38,"n_cols":15,"rows_kept":38,"cut":false,"hidden":false,"merged":[[6,2,6,3],[6,10,7,10]]}
["PRIMARY/SECONDARY TRANSITION: PUPIL DATA SHEET"]
[]
[null,null,null,null,null,null,null,null,null,null,null,null,"Pupil Number:",null,1]
[]
["Pupil Name:",null,{"$f":"VLOOKUP($O$3,Datasheet!$A$17:$AR$326,10,FALSE)","v":0},null,"Primary School:",null,{"$f":"VLOOKUP($O$3,Datasheet!$A$17:$AR$326,3,FALSE)","v":0},null,null,"Postcode:",{"$f":"IF(ISBLANK(VLOOKUP($O$3,Datasheet!$A$17:$AT$326,45,FALSE)),\"\",VLOOKUP($O$3,Datasheet!$A$17:$AT$326,45,FALSE))","v":""}]
[]
["DOB:",null,{"$f":"VLOOKUP($O$3,Datasheet!$A$17:$AR$326,11,FALSE)","v":"00:00:00"},null,"Sec Destination:",null,{"$f":"VLOOKUP($O$3,Datasheet!$A$17:$AR$326,5,FALSE)","v":0},null,null,"Home LA:",{"$f":"IF(ISBLANK(VLOOKUP($O$3,Datasheet!$A$17:$AT$326,46,FALSE)),\"\",VLOOKUP($O$3,Datasheet!$A$17:$AT$326,46,FALSE))","v":""}]
[null,null,null,null,"Admissions Status:",null,{"$f":"VLOOKUP($O$3,Datasheet!$A$17:$AR$326,6,FALSE)","v":0}]
[]
["Pupil Characteristics"]
["Gender:",null,null,{"$f":"VLOOKUP($O$3,Datasheet!$A$17:$AO$326,12,FALSE)","v":0},null,null,"FSM:",null,null,{"$f":"VLOOKUP($O$3,Datasheet!$A$17:$AR$326,14,FALSE)","v":0}]
["Ethnicity:",null,null,{"$f":"IF(ISBLANK(VLOOKUP($O$3,Datasheet!$A$17:$AO$326,16,2)),\"\",VLOOKUP(VLOOKUP($O$3,Datasheet!$A$17:$AO$326,16,2),'Ethnicity Codes'!A4:B102,2,FALSE))","v":""},null,null,"Pupil premium (FSM6):",null,null,{"$f":"VLOOKUP($O$3,Datasheet!$A$17:$AR$326,15,FALSE)","v":0}]
["Country of Birth:",null,null,{"$f":"IF(ISBLANK(VLOOKUP($O$3,Datasheet!$A$17:$AO$326,17,2)),\"\",VLOOKUP(VLOOKUP($O$3,Datasheet!$A$17:$AO$326,17,2),'Country of Birth & Nationality'!A4:B295,2,FALSE))","v":""},null,null,"Traveller:",null,null,{"$f":"VLOOKUP($O$3,Datasheet!$A$17:$AR$326,26,FALSE)","v":0}]
["Nationality",null,null,{"$f":"IF(ISBLANK(VLOOKUP($O$3,Datasheet!$A$17:$AO$326,18,2)),\"\",VLOOKUP(VLOOKUP($O$3,Datasheet!$A$17:$AO$326,18,2),'Country of Birth & Nationality'!A4:B295,2,FALSE))","v":""},null,null,"Proficiency in English:",null,null,{"$f":"VLOOKUP($O$3,Datasheet!$A$17:$AR$326,22,FALSE)","v":0}]
["Date of Entry:",null,null,{"$f":"VLOOKUP($O$3,Datasheet!$A$17:$AO$326,13,FALSE)","v":"00:00:00"},null,null,"G&T Register:",null,null,{"$f":"VLOOKUP($O$3,Datasheet!$A$17:$AR$326,27,FALSE)","v":0}]
["SEN Status:",null,null,{"$f":"IF(ISBLANK(VLOOKUP($O$3,Datasheet!$A$17:$AR$326,19,FALSE)),\"\",VLOOKUP(VLOOKUP($O$3,Datasheet!$A$17:$AR$326,19,FALSE),'SEN Codes'!A4:B19,2,FALSE))","v":""},null,null,"G&T Details:",null,null,{"$f":"VLOOKUP($O$3,Datasheet!$A$17:$AR$326,28,FALSE)","v":0}]
["SEN Primary Need:",null,null,{"$f":"IF(ISBLANK(VLOOKUP($O$3,Datasheet!$A$17:$AO$326,20,FALSE)),\"\",VLOOKUP(VLOOKUP($O$3,Datasheet!$A$17:$AO$326,20,FALSE),'SEN Codes'!A4:B19,2,FALSE))","v":""},null,null,"MFL (Y6):",null,null,{"$f":"IF(ISBLANK(VLOOKUP($O$3,Datasheet!$A$17:$AR$326,29,FALSE)),\"\",VLOOKUP($O$3,Datasheet!$A$17:$AR$326,29,FALSE))","v":""}]
["First Language:",null,null,{"$f":"IF(ISBLANK(VLOOKUP($O$3,Datasheet!$A$17:$AO$326,21,FALSE)),\"\",VLOOKUP(VLOOKUP($O$3,Datasheet!$A$17:$AO$326,21,FALSE),'Language Codes'!A4:C325,3,FALSE))","v":""}]
["Looked After:",null,null,{"$f":"VLOOKUP($O$3,Datasheet!$A$17:$AR$326,25,FALSE)","v":0},null,null,"Attendance (full prev. yr)",null,null,{"$f":"IF(ISBLANK(VLOOKUP($O$3,Datasheet!$A$17:$AR$326,23,FALSE)),\"\",VLOOKUP($O$3,Datasheet!$A$17:$AR$326,23,FALSE))","v":""}]
[null,null,null,null,null,null,"Attendance (Aut Term)",null,null,{"$f":"IF(ISBLANK(VLOOKUP($O$3,Datasheet!$A$17:$AR$326,24,FALSE)),\"\",VLOOKUP($O$3,Datasheet!$A$17:$AR$326,24,FALSE))","v":""}]
[]
["KS2 Provisional Teacher Assessments"]
["Reading:",{"$f":"VLOOKUP($O$3,Datasheet!$A$17:$AR$326,30,FALSE)","v":0},"Writing:",{"$f":"VLOOKUP($O$3,Datasheet!$A$17:$AR$326,31,FALSE)","v":0},"Maths:",{"$f":"VLOOKUP($O$3,Datasheet!$A$17:$AR$326,32,FALSE)","v":0},"Science:",{"$f":"VLOOKUP($O$3,Datasheet!$A$17:$AR$326,33,FALSE)","v":0}]
[]
[]
["Other Agency Involvement"]
["EHAP",null,{"$f":"VLOOKUP($O$3,Datasheet!$A$17:$AR$326,34,FALSE)","v":0},null,"SEN",{"$f":"VLOOKUP($O$3,Datasheet!$A$17:$AR$326,38,FALSE)","v":0},null,"Travellers Team",null,{"$f":"VLOOKUP($O$3,Datasheet!$A$17:$AR$326,41,FALSE)","v":0}]
["Behaviour Support",null,{"$f":"VLOOKUP($O$3,Datasheet!$A$17:$AR$326,35,FALSE)","v":0},null,"EAL",{"$f":"VLOOKUP($O$3,Datasheet!$A$17:$AR$326,39,FALSE)","v":0},null,"Sensory Impairment",null,{"$f":"VLOOKUP($O$3,Datasheet!$A$17:$AR$326,42,FALSE)","v":0}]
["EPS",null,{"$f":"VLOOKUP($O$3,Datasheet!$A$17:$AR$326,36,FALSE)","v":0},null,"LAC",{"$f":"VLOOKUP($O$3,Datasheet!$A$17:$AR$326,40,FALSE)","v":0},null,"Other",null,{"$f":"VLOOKUP($O$3,Datasheet!$A$17:$AR$326,43,FALSE)","v":0}]
["ESW",null,{"$f":"VLOOKUP($O$3,Datasheet!$A$17:$AR$326,37,FALSE)","v":0}]
[]
["Confidential Data Needs to be Transferred",null,null,null,{"$f":"VLOOKUP($O$3,Datasheet!$A$17:$AR$326,44,FALSE)","v":0}]
[]
[]
["Notes"]
["Please use the space below to record any additional information during your visit to the pupil's primary school. For example,"]
["relationships with peers and adults, friendship groups, particular strengths and weaknesses, out of schools activities such "]
["as arts, sport, supplementary school etc."]

{"sheet":"Ethnicity Codes","index":3,"n_rows":102,"n_cols":5,"rows_kept":102,"cut":false,"hidden":true,"merged":[[30,4,45,4],[3,2,8,2],[3,3,8,3],[3,4,29,4],[11,3,28,3],[11,2,28,2],[32,2,35,2],[32,3,35,3],[36,2,45,2],[36,3,45,3],[47,2,50,2],[47,3,50,3],[46,4,59,4],[52,2,59,2],[52,3,59,3],[80,3,99,3],[80,4,99,4],[80,2,99,2],[100,4,101,4],[62,2,69,2],[62,3,69,3],[74,4,79,4],[60,4,73,4],[70,2,73,2],[70,3,73,3],[74,2,79,2],[74,3,79,3]]}
["Ethnicity codes"]
[]
["DfES Extended Codes","Approved Extended Categories","DfES Main Code","Sub Category","Main Category"]
["WBRI","White British","WBRI","White - British","White "]
["WCOR","White Cornish"]
["WENG","White English "]
["WSCO","White Scottish"]
["WWEL","White Welsh"]
["WOWB","Other White British"]
["WIRI","White Irish","WIRI","White - Irish"]
["WIRT","Traveller of Irish Heritage","WIRT","Traveller of Irish Heritage"]
["WOTH","Any Other White Background","WOTH","Any Other White Background"]
["WALB","Albanian "]
["WBOS","Bosnian-Herzegovinian"]
["WCRO","Croatian"]
["WGRE","Greek/ Greek Cypriot"]
["WGRK","Greek"]
["WGRC","Greek Cypriot"]
["WITA","Italian"]
["WKOS","Kosovan"]
["WPOR","Portuguese"]
["WSER","Serbian"]
["WTUR","Turkish/ Turkish Cypriot"]
["WTUK","Turkish"]
["WTUC","Turkish Cypriot"]
["WEUR","White European"]
["WEEU","White Eastern European "]
["WWEU","White Western European "]
["WOTW","White Other "]
["WROM","Gypsy / Roma","WROM","Gypsy / Roma"]
["MWBC","White & Black Caribbean","MWBC","White and Black Caribbean","Mixed / Dual Background"]
["MWBA","White & Black African","MWBA","White and Black African"]
["MWAS","White & Asian","MWAS","White and Asian"]
["MWAP","White & Pakistani"]
["MWAI","White & Indian"]
["MWAO","White & Any Other Asian Backgr'd"]
["MOTH","Any Other Mixed Background","MOTH","Any Other Mixed Background"]
["MAOE","Asian & Any Other Ethnic Group"]
["MABL","Asian & Black"]
["MACH","Asian & Chinese"]
["MBOE","Black & Any Other Ethnic Group"]
["MBCH","Black & Chinese "]
["MCOE","Chinese & Any Other Ethnic Group"]
["MWOE","White & Any Other Ethnic Group"]
["MWCH","White & Chinese"]
["MOTM","Other Mixed Background"]
["AIND","Indian","AIND","Indian","Asian or Asian British"]
["APKN","Pakistani","APKN","Pakistani"]
["AMPK","Mirpuri Pakistani"]
["AKPA","Kashmiri Pakistani"]
["AOPK","Other Pakistani"]
["ABAN","Bangladeshi","ABAN","Bangladeshi"]
["AOTH","Any Other Asian Background","AOTH","Any Other Asian Background"]
["AAFR","African Asian "]
["AKAO","Kashmiri Other"]
["ANEP","Nepali"]
["ASNL","Sri Lankan Sinhalese"]
["ASLT","Sri Lankan Tamil"]
["ASRO","Sri Lankan Other"]
["AOTA","Other Asian"]
{"$rows_left_out":43}
{"sheet":"Country of Birth & Nationality","index":4,"n_rows":295,"n_cols":5,"rows_kept":295,"cut":false,"hidden":true,"merged":[[0,0,0,1]]}
["Country of Birth/Nationality Codes"]
[]
["ISO 3166-1\nAlpha-3","Nation Short Name","Nation Long Name","Current?","Notes"]
["AFG","Afghanistan","The Transitional Islamic State of Afghanistan","Yes"]
["ALA","Aland Islands","Aland Islands","Yes","From 2004. Formerly part of (old) Finland."]
["ALB","Albania","Republic of Albania","Yes"]
["DZA","Algeria","Democratic and Popular\nRepublic of Algeria","Yes"]
["ASM","American Samoa","American Samoa","Yes"]
["AND","Andorra","Principality of Andorra","Yes"]
["AGO","Angola","Republic of Angola","Yes"]
["AIA","Anguilla","Anguilla","Yes","From 1985. Formerly part of Saint Kitts-Nevis-\nAnguilla."]
["ATA","Antarctica","Antarctica","Yes"]
["ATG","Antigua and Barbuda","Antigua and Barbuda","Yes"]
["ARG","Argentina","Argentine Republic","Yes"]
["ARM","Armenia","Republic of Armenia","Yes","From 1992. Formerly part\nof Union of Soviet Socialist\nRepublics (USSR)."]
["ABW","Aruba","Aruba","Yes","From 1986. Formerly part\nof (old) Netherlands\nAntiles."]
["AUS","Australia","Commonwealth of Australia","Yes"]
["AUT","Austria","Republic of Austria","Yes"]
["AZE","Azerbaijan","Azerbaijani Republic","Yes","From 1992. Formerly part of Union of Soviet Socialist\nRepublics (USSR)."]
["BHS","Bahamas","Commonwealth of The\nBahamas","Yes"]
["BHR","Bahrain","State of Bahrain","Yes"]
["BGD","Bangladesh","People's Republic of\nBangladesh","Yes"]
["BRB","Barbados","Barbados","Yes"]
["BLR","Belarus","Republic of Belarus","Yes","From 1992. Formerly part of Union of Soviet Socialist\nRepublics (USSR). Formerly Byelorussian\nSSR. New name from\n1992."]
["BEL","Belgium","Kingdom of Belgium","Yes"]
["BLZ","Belize","Belize","Yes"]
["BEN","Benin","Republic of Benin","Yes","Formerly Dahomey. New name from 1977."]
["BMU","Bermuda","Bermuda","Yes"]
["BTN","Bhutan","Kingdom of Bhutan","Yes"]
["BOL","Bolivia","Republic of Bolivia","Yes"]
["BES","Bonaire, Sint Eustatius and Saba","Bonaire, Sint Eustatius and\nSaba","Yes","The code BQ was formerly used for British\nAntarctic Territory (BQ, ATB, --). See also code\nelement BQAQ. BQ has\nbeen reused and reassigned to Bonaire, Sint Eustatius and Saba. The Netherlands Antilles (AN, ANT, 530) was divided into (BQ, BES,\n535), (CW, CUW, 531) and (SX, SXM, 534). See also code element ANHH"]
["BIH","Bosnia and Herzegovina","Bosnia and Herzegovina","Yes","From 1993. Formerly part of Yugoslavia."]
["BWA","Botswana","Republic of Botswana","Yes"]
["BVT","Bouvet Island","Bouvet Island","Yes"]
["BRA","Brazil","Federative Republic of Brazil","Yes"]
["ATB","British Antarctic Territory","British Antarctic Territory","No","From 1979 part of\nAntarctica."]
["IOT","British Indian Ocean\nTerritory","British Indian Ocean Territory","Yes"]
["BRN","Brunei","Negara Brunei Darussalam","Yes"]
["BGR","Bulgaria","Republic of Bulgaria","Yes"]
["BFA","Burkina Faso","Burkina Faso","Yes","Formerly Upper Volta. New name from 1984."]
["BUR","Burma","Burma","No","From 1989 named\nMynmar."]
["BDI","Burundi","Republic of Burundi","Yes"]
["BYS","Byelorussian SSR","Byelorussian Soviet Socialist\nRepublic","No","From 1992 named Belarus."]
["KHM","Cambodia","Kingdom of Cambodia","Yes","Formerly Kampuchea. New\nname from 1990."]
["CMR","Cameroon","Republic of Cameroon","Yes"]
["CAN","Canada","Canada","Yes"]
["CTE","Canton and Enderbury\nIslands","Canton and Enderbury Islands","No","From 1984 merged with\nKiribati."]
["CPV","Cape Verde","Republic of Cape Verde","Yes"]
["CYM","Cayman Islands","Cayman Islands","Yes"]
["CAF","Central African Republic","Central African Republic","Yes"]
["TCD","Chad","Republic of Chad","Yes"]
["CHL","Chile","Republic of Chile","Yes"]
["CHN","China","People's Republic of China","Yes"]
["CXR","Christmas Island","Christmas Island","Yes"]
["CCK","Cocos (Keeling) Islands","Cocos (Keeling) Islands","Yes"]
["COL","Colombia","Republic of Colombia","Yes"]
["COM","Comoros","Union of the Comoros","Yes","Formerly named Federal\nIslamic Republic of the\nComoros. New name from\n2003."]
["COG","Congo","Republic of the Congo","Yes"]
["COD","Congo, Democratic\nRepublic","Democratic Republic of the\nCongo","Yes","Formerly Zaire. New name\nfrom 1997."]
["COK","Cook Islands","Cook Islands","Yes"]
{"$rows_left_out":236}
{"sheet":"Language Codes","index":5,"n_rows":325,"n_cols":3,"rows_kept":325,"cut":false,"hidden":true,"merged":[]}
["First Language codes"]
[]
["Main Code","Sub Code","Descriptor"]
["ACL",null,"Acholi"]
["ADA",null,"Adangme"]
["AFA",null,"Afar-Saho"]
["AFK",null,"Afrikaans"]
["AKA",null,"Akan/Twi-Fante"]
["AKAF","AKA","Akan (Fante)"]
["AKAT","AKA","Akan (Twi/Asante)"]
["ALB",null,"Albanian/Shqip"]
["ALU",null,"Alur"]
["AMR",null,"Amharic"]
["ARA",null,"Arabic"]
["ARAA","ARA","Arabic (Any Other)"]
["ARAG","ARA","Arabic (Algeria)"]
["ARAI","ARA","Arabic (Iraq)"]
["ARAM","ARA","Arabic (Morocco)"]
["ARAS","ARA","Arabic (Sudan)"]
["ARAY","ARA","Arabic (Yemen)"]
["ARM",null,"Armenian"]
["ASM",null,"Assamese"]
["ASR",null,"Assyrian/Aramaic"]
["AYB",null,"Anyi-Baule"]
["AYM",null,"Aymara"]
["AZE",null,"Azeri"]
["BAI",null,"Bamileke (Any)"]
["BAL",null,"Balochi"]
["BEJ",null,"Beja/Bedawi"]
["BEL",null,"Belarusian"]
["BEM",null,"Bemba"]
["BHO",null,"Bhojpuri"]
["BIK",null,"Bikol"]
["BLT",null,"Balti Tibetan"]
["BMA",null,"Burmese/Myanma"]
["BNG",null,"Bengali"]
["BNGA","BNG","Bengali (Any Other)"]
["BNGC","BNG","Bengali (Chittagong/Noakhali)"]
["BNGS","BNG","Bengali (Sylheti)"]
["BSL",null,"British Sign Language"]
["BSQ",null,"Basque/Euskara"]
["BUL",null,"Bulgarian"]
["CAM",null,"Cambodian/Khmer"]
["CAT",null,"Catalan"]
["CCE",null,"Caribbean Creole English"]
["CCF",null,"Caribbean Creole French"]
["CGA",null,"Chaga"]
["CGR",null,"Chattisgarhi/Khatahi"]
["CHE",null,"Chechen"]
["CHI",null,"Chinese"]
["CHIA","CHI","Chinese (Any Other)"]
["CHIC","CHI","Chinese (Cantonese)"]
["CHIH","CHI","Chinese (Hokkien/Fujianese)"]
["CHIK","CHI","Chinese (Hakka)"]
["CHIM","CHI","Chinese (Mandarin/Putonghua)"]
["CKW",null,"Chokwe"]
["CRN",null,"Cornish"]
["CTR",null,"Chitrali/Khowar"]
["CWA",null,"Chichewa/Nyanja"]
["CYM",null,"Welsh/Cymraeg"]
{"$rows_left_out":266}
{"sheet":"SEN Codes","index":6,"n_rows":20,"n_cols":2,"rows_kept":20,"cut":false,"hidden":true,"merged":[]}
["SEN Codes"]
[]
["Code","Description"]
["N","No SEN Provision"]
["S","Statement of SEN"]
["E","Education, Health and Care Plan"]
["K","SEN Support"]
["SPLD","Specific Learning Difficulty"]
["MLD","Moderate Learning Difficulty"]
["SLD","Severe Learning Difficulty"]
["PMLD","Profound & Multiple Learning Diff."]
["SEMH","Social, Emotional and Mental Health"]
["SLCN","Speech, Lang. & Comm. Needs"]
["ASD","Autistic Spectrum Disorder "]
["VI","Visual impairment "]
["HI","Hearing Impairment "]
["MSI","Multi-sensory Impairment "]
["PD","Physical Disability"]
["OTH","Other"]
["NSA","SEN Support but no Specialist Assessment is Needed"]